Fakultas Ilmu Komputer UI

Implement display time at footer page

4 jobs for 1606917720-63 in 7 minutes and 45 seconds (queued for 2 seconds)
latest
Status Name Job ID Coverage
  Test
passed test-backend #61476

00:03:10

83.0%
failed test-frontend #61478

00:04:35

failed test-frontend #61475

00:05:02

 
  Deploy
skipped pages #61477
 
Name Stage Failure
failed
test-frontend Test
npm ERR! kape@1.0.0 karma: `karma start --single-run`
npm ERR! Exit status 1
npm ERR!
npm ERR! Failed at the kape@1.0.0 karma script.
npm ERR! This is probably not a problem with npm. There is likely additional logging output above.

npm ERR! A complete log of this run can be found in:
npm ERR! /root/.npm/_logs/2019-10-12T17_19_34_493Z-debug.log
ERROR: Job failed: exit code 1