Fakultas Ilmu Komputer UI

Try to add unwanted, unused vars

4 jobs for spike/short-live-branch-analysis in 5 minutes and 49 seconds (queued for 1 second)
latest
Status Name Job ID Coverage
  Test
passed SonarScanner Analysis #80570

00:05:15

failed test-backend #80569

00:05:48

failed test-frontend #80568

00:04:27

 
  Deploy
skipped pages #80571
 
Name Stage Failure
failed
test-backend Test
  File "<frozen importlib._bootstrap>", line 991, in _find_and_load
File "<frozen importlib._bootstrap>", line 975, in _find_and_load_unlocked
File "<frozen importlib._bootstrap>", line 671, in _load_unlocked
File "<frozen importlib._bootstrap_external>", line 783, in exec_module
File "<frozen importlib._bootstrap>", line 219, in _call_with_frames_removed
File "/builds/pmpl/class-project/kape/kape/urls.py", line 46, in <module>
router.register(r'vacancies/(?P<vacancy_id>\d+)/milestones', VacancyMilestoneViewSet,
TypeError: register() got an unexpected keyword argument 'base_name'
ERROR: Job failed: exit code 1
failed
test-frontend Test
$ npm install
npm WARN kape@1.0.0 No repository field.

npm ERR! code E429
npm ERR! 429 Too Many Requests - GET https://registry.npmjs.org/json5/-/json5-2.1.1.tgz

npm ERR! A complete log of this run can be found in:
npm ERR! /root/.npm/_logs/2020-02-17T12_18_59_958Z-debug.log
ERROR: Job failed: exit code 1