Fakultas Ilmu Komputer UI

implement the category field on company

Status Name Job ID Coverage
  Test
failed test #57657

00:21:36

 
  Deploy
skipped pages #57658
 
Name Stage Failure
failed
test Test
npm ERR! peerinvalid Peer react-dom@15.4.2 wants react@^15.4.2
npm ERR! peerinvalid Peer react-router@3.2.4 wants react@^0.14.0 || ^15.0.0 || ^16.0.0
npm ERR! peerinvalid Peer react-select@3.0.8 wants react@^16.8.0
npm ERR! peerinvalid Peer react-tap-event-plugin@2.0.1 wants react@^15.4.0-0
npm ERR! peerinvalid Peer semantic-ui-react@0.67.2 wants react@>=0.14.0 <= 15

npm ERR! Please include the following file with any support request:
npm ERR! /builds/pmpl/class-project/kape/npm-debug.log
ERROR: Job failed: exit code 1