Fakultas Ilmu Komputer UI

migrate database

Status Name Job ID Coverage
  Test
failed test #57693

00:22:49

86.0%
 
  Deploy
skipped pages #57694
 
Name Stage Failure
failed
test Test
npm ERR!     npm bugs kape
npm ERR! Or if that isn't available, you can get their info via:
npm ERR!
npm ERR! npm owner ls kape
npm ERR! There is likely additional logging output above.

npm ERR! Please include the following file with any support request:
npm ERR! /builds/pmpl/class-project/kape/npm-debug.log
ERROR: Job failed: exit code 1