Fakultas Ilmu Komputer UI

bug fix

3 jobs for 1606918446-79 in 2 minutes and 9 seconds (queued for 2 seconds)
latest
Status Name Job ID Coverage
  Test
failed test-backend #61516

00:01:30

failed test-frontend #61515

00:02:09

 
  Deploy
skipped pages #61517
 
Name Stage Failure
failed
test-frontend Test
npm ERR! kape@1.0.0 build-production: `webpack -p --config webpack.prod.config.js --progress --colors`
npm ERR! Exit status 2
npm ERR!
npm ERR! Failed at the kape@1.0.0 build-production script.
npm ERR! This is probably not a problem with npm. There is likely additional logging output above.

npm ERR! A complete log of this run can be found in:
npm ERR! /root/.npm/_logs/2019-10-13T06_18_49_911Z-debug.log
ERROR: Job failed: exit code 1
failed
test-backend Test
    output = self.handle(*args, **options)
File "/usr/local/lib/python2.7/site-packages/django/core/management/commands/makemigrations.py", line 96, in handle
loader = MigrationLoader(None, ignore_no_migrations=True)
File "/usr/local/lib/python2.7/site-packages/django/db/migrations/loader.py", line 52, in __init__
self.build_graph()
File "/usr/local/lib/python2.7/site-packages/django/db/migrations/loader.py", line 275, in build_graph
raise exc
django.db.migrations.exceptions.NodeNotFoundError: Migration core.0020_merge_20191006_2059 dependencies reference nonexistent parent node (u'core', u'0017_vacancy_amount')
ERROR: Job failed: exit code 1