Fakultas Ilmu Komputer UI

merge conflict

3 jobs for 1606879773-27 in 3 minutes and 30 seconds (queued for 1 second)
Status Name Job ID Coverage
  Test
passed test-backend #67195

00:03:30

84.0%
failed test-frontend #67194

00:02:25

 
  Deploy
skipped pages #67196
 
Name Stage Failure
failed
test-frontend Test
npm ERR! kape@1.0.0 build-production: `webpack -p --config webpack.prod.config.js --progress --colors`
npm ERR! Exit status 2
npm ERR!
npm ERR! Failed at the kape@1.0.0 build-production script.
npm ERR! This is probably not a problem with npm. There is likely additional logging output above.

npm ERR! A complete log of this run can be found in:
npm ERR! /root/.npm/_logs/2019-11-15T12_22_31_739Z-debug.log
ERROR: Job failed: exit code 1